Home > The Specified > Error 1 The Specified Module Could Not Be Found. (exception From Hresult 0x8007007e)

Error 1 The Specified Module Could Not Be Found. (exception From Hresult 0x8007007e)

Contents

Stack Overflow depends on everyone sharing their knowledge. Headphone symbol when headphones not in use Are the following topics usually in an introductory Complex Analysis class: Julia sets, Fatou sets, Mandelbrot set, etc? I got it resolved. After noticing the issue I also ran the "aspnet_regiis" util, but the problem remains. check over here

Please help me someone. Regards, Deepak   Monday, November 27, 2006 10:37 AM Answers 0 Sign in to vote You may have a dependency on an assembly that only exists for 32-bit or hasn't been What early computers had excellent BASIC (or other language) at bootup? Copied UnmanagedTest.dll inside the bin directory of the web application. Homepage

Error 1 The Specified Module Could Not Be Found. (exception From Hresult 0x8007007e)

Exception Details: System.IO.FileNotFoundException: The specified module could not be found. (Exception from HRESULT: 0x8007007E) Now i fully understand that the app cannot load some kind of resource due to a FileNotFoundException, But I can't solve it. You signed in with another tab or window. First a bit of background about the application as it holds the clue to the whole thing.

Does every data type just boil down to nodes with pointers? So, it's possible to work from the hard disk only when the USB memory is inside, even when the whole project was copied and pasted from the USB to the hard Node modules have 755 permissions, what permissions should I set so that npm don't require sudo? System.io.filenotfoundexception The Specified Module Could Not Be Found more stack exchange communities company blog Stack Exchange Inbox Reputation and Badges sign up log in tour help Tour Start here for a quick overview of the site Help Center Detailed

Thanks, Kanwal Reply [email protected] 6 Posts Re: Newby to IIS7.0 - The specified module could not be found. (0x8007007e) error Mar 10, 2010 07:02 PM|[email protected]|LINK not sure what xpress compression is... The same application is running properly in 32 bit mechine. Learning resources Microsoft Virtual Academy Channel 9 MSDN Magazine Community Forums Blogs Codeplex Support Self support Programs BizSpark (for startups) Microsoft Imagine (for students) United States (English) Newsletter Privacy & cookies if you use any assembly which is not in GAC, you will get this kind of error, please add your assembly in GAC 2.

thanks Reply ksingla 1068 Posts Microsoft Re: Newby to IIS7.0 - The specified module could not be found. (0x8007007e) error Mar 10, 2010 05:00 PM|ksingla|LINK Are you using xpress compression? 0x8007007e Windows 10 The specified module could not be found. (Exception from HRESULT: 0x8007007E)1DllNotFoundException: Unable to load DLL 'nativrd2.dll': The specified module could not be found. (Exception from HRESULT: 0x8007007E)0Unable to load DLL 'spssio32.dll': But when I try to run the web service I get the following error which is shown in the web browser: The specified module could not be found. (Exception from HRESULT: GuardRex commented Apr 22, 2015 It might be related to my issues with config.json described at aspnet/Home#474.

The Specified Module Could Not Be Found Exception From Hresult 0x8007007e In C#

Weird CentOS server behavior time zones How to select and output text in a string Homework / toy program - character matching Why does the `reset` command include a delay? The specified module could not be found. (Exception from HRESULT: 0x8007007E) Description: An unhandled exception occurred during the execution of the current web request. Error 1 The Specified Module Could Not Be Found. (exception From Hresult 0x8007007e) Join them; it only takes a minute: Sign up “The specified module could not be found” error when running C# ASP.NET web service referring C++ dll up vote 1 down vote Asp.net The Specified Module Could Not Be Found. (exception From Hresult: 0x8007007e) I have no idea how the dll got in the bin file in the first place.

The content you requested has been removed. check my blog It clearly states that the application (irrespective of its type) failed due to a missing module. Exception Details: System.IO.FileNotFoundException: The specified module could not be found. (Exception from HRESULT: 0x8007007E) Stack trace offers no clue on the problematic dll either. Browse other questions tagged asp.net c++ web-services dll dependencies or ask your own question. The Specified Module Could Not Be Found Exception From Hresult Vmware

Any advice on diagnosing the root cause of the issue would be greatly appreciated. Does anyone know what that blue thing is? Why do CDs and DVDs fill up from the centre outwards? this content Next obvious question: which module am I missing?

Weird CentOS server behavior time zones Metaprogramming: creating compiled functions from inter-dependent code blocks Solving the integral of a function with modulus How to change "niceness" while perfoming top command? Msvcr71.dll Windows 7 What reasons are there to stop the SQL Server? We recommend upgrading to the latest Safari, Google Chrome, or Firefox.

Right click your web project, properties, there should be tab called web, Use Local IIS, Create Virtual Directory. –GenEric35 Jul 5 '10 at 19:45 Referencing a C++ dll can

It failed with the above mentioned error message. Thanks for the help. Why does the `reset` command include a delay? An Attempt Was Made To Load A Program With An Incorrect Format. (exception From Hresult: 0x8007000b) Information regarding the origin and location of the exception can be identified using the exception stack trace below.  Stack Trace: [FileNotFoundException: The specified module could not be found. (Exception from HRESULT:

Please review the stack trace for more information about the error and where it originated in the code. asked 3 years ago viewed 334 times Related 2specified module could not be found - classic asp1Asp.net published web site: The specified module could not be found. more stack exchange communities company blog Stack Exchange Inbox Reputation and Badges sign up log in tour help Tour Start here for a quick overview of the site Help Center Detailed http://0pacity.com/the-specified/the-specified-module-could-not-be-found-usb.html excellent answer....

The C++ dll you're refering, it's compiled in 32bit or 64? One of the apps, which runs on asp.net v2.0 using forms authentication will not load. Have a close look into theprobing paths of the dll :these paths are multiple values of the "PATH" environement variable on the server.Why doesw3wp.exe look for a native dll in these Or it's merely an ordinary mistake?

Hope this helps. Information regarding the origin and location of the exception can be identified using the exception stack trace below.